{"text_format":"1","workbook":"xlsx","n_sheets":6,"sheets":["Wichtige Hinweise","Reisekostenabrechnung","Sonstige Kosten","Tagessätze","AP Auswahlwerte","Sonstige Kosten - Auswahl"],"not_rendered":{"charts":0,"images":2,"macros":1,"external_links":1,"defined_names":23,"comments":1,"pivot_tables":0},"unopened":[],"bounds":{"document_bytes":16777216,"sheet_cells":100000,"rows_first":2000,"rows_last":500,"rows_between":2000,"halvings":0,"cell_chars":16384,"cell_head_chars":4096},"cells_cut":0,"cells_raw":0,"read":"whole","date_system":"1900"}

{"sheet":"Wichtige Hinweise","index":0,"n_rows":52,"n_cols":2,"rows_kept":52,"cut":false,"hidden":true,"merged":[]}
["Hinweise zum Arbeiten mit der Muster-Reisekostenabrechnung"]
[]
[]
["1.","Für die Nutzung dieser Datei setzen wir Excel-Kenntnisse voraus, da u. U. an einigen Stellen Zellen eingefügt oder neu formatiert werden müssen, z. B. "]
[null,"wenn vorhandene  Zellen nicht ausreichen. Generell sind nur Zellen der in BLAUER SCHRIFT gekennzeichneten Spalten Eingabefelder."]
[]
["2.","Vor Nutzung der Reisekostenabrechnung sind in den Zeilen 1 bis 3 die Firmenbezeichnung, Abrechnungszeitraum und Name des Arbeitnehmers einzutragen. "]
[null,"Bitte benennen Sie in den Zeilen 5 und 6 unbedingt mittels der hinterlegten Drop-Down-Menüs Ihre innerbetrieblichen Regelungen zur Abrechnung der "]
[null,"Reisekosten bzw. Ihre Reisekosten-Richtlinien. "]
[]
["3.","In die Spalte F ist das Land einzugeben; bitte beachten Sie, dass wir ein Drop-Down-Menü zur Auswahl hinterlegt haben. Bei Besuch mehrerer Länder "]
[null,"an einem Tag ist der letzte Tätigkeitsort im Ausland maßgebend; bei Flügen Inland - Ausland zählt die Flugzeit zur Auslandszeit."]
[null,"Es werden die ab 1. Januar 2026 geltenden Pauschbeträge berücksichtigt."]
[null,"Für nicht erfasste Länder ist der für Luxemburg geltende Pauschbetrag maßgebend, für nicht erfasste Übersee- und Außengebiete eines Landes"]
[null,"ist der für das Mutterland geltende Pauschbetrag maßgebend."]
[]
["4.","In der Spalte L sind die gefahrenen Kilometer (hin und zurück) einzutragen. Die Reisekosten errechnen sich automatisch in Spalte M unter Berücksichtigung "]
[null,"der derzeit gültigen Kilometerpauschale von 0,38 Euro."]
[]
["5.","In den Spalten N, O und P sind zwingend diejenigen Mahlzeiten zu erfassen, die durch den Arbeitgeber gewährt wurden (z.B. bei Seminarbuchungen,"]
{"$rows_left_out":33}
{"sheet":"Reisekostenabrechnung","index":1,"n_rows":53,"n_cols":27,"rows_kept":53,"cut":false,"hidden":false,"merged":[[52,1,52,4],[7,7,7,8],[9,6,10,6],[7,11,9,11],[8,8,9,8],[39,1,39,7],[51,1,51,4],[50,1,50,2],[48,3,48,6],[8,5,9,5],[7,1,7,5],[37,0,37,1],[0,1,0,25],[2,1,2,25],[1,1,1,25],[4,7,4,8],[4,1,4,6],[4,14,4,19],[4,20,4,25],[9,26,10,26],[10,24,10,25],[8,19,10,19],[8,17,10,17],[7,9,8,10],[9,9,10,9],[9,10,10,10],[7,17,7,21],[7,14,9,16],[8,20,10,20],[8,18,10,18],[8,21,10,21],[8,22,10,22],[8,23,10,23],[5,20,5,24],[5,14,5,19],[7,24,9,25],[47,3,47,6],[49,22,50,25],[40,22,40,25],[42,22,42,25],[43,22,43,25],[44,22,46,25],[47,22,48,25],[41,22,41,25],[39,22,39,25],[45,15,46,15],[44,20,46,21],[47,20,48,21],[49,20,50,21]]}
[null,"Firmennamen und Anschrift eingeben"]
[null,"Reisekostenabrechnung MM / 2026"]
[null,"Arbeitnehmer: Name eingeben"]
[]
[null,"Sollen Verpflegungspauschalen an den Arbeitnehmer gezahlt werden?",null,null,null,null,null,"BITTE AUSWÄHLEN",null,null,null,null,null,null,"Werden Kosten für veranlasste Mahlzeiten erstattet?  ",null,null,null,null,null,"BITTE AUSWÄHLEN"]
[null,null,null,null,null,null,null,null,null,null,null,null,null,null,"Wie erfolgt Versteuerung steuerpflichtiger Mahlzeiten?",null,null,null,null,null,"BITTE AUSWÄHLEN"]
[]
[null,"Daten in jeder Spalte einzutragen (auch bei 1-tägiger Reise)",null,null,null,null,"Reiseziel","Verpflegungssatz",null,"Abwesenheit\n(nur für Berechnungszwecke)",null,"Verpfle-\ngungspau-\nschale","Gefahrene","Kilometer","Vom Arbeitgeber veranlasste Mahlzeiten: \nAnzahl bitte eintragen!\n",null,null,"Hotel-/Veranstaltungsrechnung",null,null,null,null,null,null,"Erstattung pauschaler Übernachtungs-\nkosten?\n"]
["Reisezweck","Datum","Uhrzeit","Datum","Uhrzeit","Über-nachtung",null,null,"An-/Abreisetag\nund > 8 Std.",null,null,null,"Kilometer","pauschale",null,null,null,"Gesamt-\nbetrag\n(brutto)","Übernach-\ntungs-\nkosten","Rngs.-\nanteil f. Mahlzeiten\n/ pauschal, wenn inkl.","Sonstige \nHotel-\nkosten ","Private Kosten (nicht vom Arbeitgeber erstattbar)","Mahlzeiten \nKürzungs-\nbetrag VMA \n","Mahlzeiten \nVersteuerungsbetrag \nSachbezug\n"]
[null,"Beginn","Beginn","Ende","Ende",null,"Land (eventuell auch Stadt)","ab 24 Std.",null,"Anzahl Tage\n> 24 Std.","Anzahl 8-24 Std.",null,null,"Kfz",null,null,null,null,null,null,null,null,null,null,null,null,"Anzahl Über-\nnachtungen"]
[null,"TT.MM.JJ","hh,mm","TT.MM.JJ","hh,mm","JA / NEIN",null,"€","€",null,null,"€",null,{"$f":"IF($N$10='AP Auswahlwerte'!$A$12,'AP Auswahlwerte'!$B$12,IF(N10='AP Auswahlwerte'!$A$13,'AP Auswahlwerte'!$B$13,0))","v":0.3},"Früh-stück","Mittag-essen","Abend-essen",null,null,null,null,null,null,null,"JA / NEIN \n"]
[null,null,null,null,null,null,"Deutschland",{"$f":"VLOOKUP(G12,Tagessätze!A$4:D$238,2,FALSE)","v":28},{"$f":"VLOOKUP(G12,Tagessätze!A$4:D$238,3,FALSE)","v":14},{"$f":"IF(D12-B12>1,D12-B12-1,0)","v":0},{"$f":"IF(B12=\"\",0,IF(D12=B12,IF(E12-C12>8,1,0),IF(F12=\"JA\",2,IF(24-C12+E12>8,1,0))))","v":0},{"$f":"IF(B12=\"\",\"\",IF($H$5=\"BITTE AUSWÄHLEN\",\"Wahl fehlt\",IF($H$5=\"JA\",(H12*J12+I12*K12),0)))","v":""},null,{"$f":"M12*$N$11","v":0},null,null,null,{"$f":"SUM(S12:V12)","v":0},null,null,null,null,{"$f":"IF(B12=\"\",\"\",IF(Reisekostenabrechnung!$U$5=JA,\"Auswahl fehlt\",IF($U$5='AP Auswahlwerte'!$I$3,MIN(L12,(Reisekostenabrechnung!O12*0.2*Reisekostenabrechnung!$H12+Reisekostenabrechnung!P12*0.4*Reisekostenabrechnung!$H12+0.4*Reisekostenabrechnung!$H12*Reisekostenabrechnung!Q12)),IF(T12='AP Auswahlwerte'!$P$2,IF(L12>0,MIN(L12,Reisekostenabrechnung!H12*(0.2*Reisekostenabrechnung!O12+0.4*Reisekostenabrechnung!P12+0.4*Reisekostenabrechnung!Q12)),0),0))))","v":""},{"$f":"IF(B12=\"\",\"\",IF(L12=0,IF($U$5='AP Auswahlwerte'!$I$2,IF(T12<>\"PAUSCHAL\",0,(O12*'AP Auswahlwerte'!$D$3+'AP Auswahlwerte'!$D$4*Reisekostenabrechnung!P12+Reisekostenabrechnung!Q12*'AP Auswahlwerte'!$D$5)),IF($U$5='AP Auswahlwerte'!$I$3,(O12*'AP Auswahlwerte'!$D$3+'AP Auswahlwerte'!$D$4*Reisekostenabrechnung!P12+Reisekostenabrechnung!Q12*'AP Auswahlwerte'!$D$5),\"Auswahl fehlt\")),0))","v":""},{"$f":"IF(B12=D12,'AP Auswahlwerte'!$A$4,IF(S12>0,'AP Auswahlwerte'!$A$3,'AP Auswahlwerte'!$A$1))","v":"-"},{"$f":"(IF(D12-B12=0,0,IF(D12=\"\",0,IF(S12=0,IF(Y12='AP Auswahlwerte'!$A$2,VLOOKUP(G12,Tagessätze!A$4:N$230,4,FALSE),0))*AA12)))","v":0},{"$f":"D12-B12","v":0}]
[null,null,null,null,null,null,"Deutschland",{"$f":"VLOOKUP(G13,Tagessätze!A$4:D$238,2,FALSE)","v":28},{"$f":"VLOOKUP(G13,Tagessätze!A$4:D$238,3,FALSE)","v":14},{"$f":"IF(D13-B13>1,D13-B13-1,0)","v":0},{"$f":"IF(B13=\"\",0,IF(D13=B13,IF(E13-C13>8,1,0),IF(F13=\"JA\",2,IF(24-C13+E13>8,1,0))))","v":0},"",null,0,null,null,null,0,null,null,null,null,{"$f":"IF(B13=\"\",\"\",IF(Reisekostenabrechnung!$U$5=JA,\"Auswahl fehlt\",IF($U$5='AP Auswahlwerte'!$I$3,MIN(L13,(Reisekostenabrechnung!O13*0.2*Reisekostenabrechnung!$H13+Reisekostenabrechnung!P13*0.4*Reisekostenabrechnung!$H13+0.4*Reisekostenabrechnung!$H13*Reisekostenabrechnung!Q13)),IF(T13='AP Auswahlwerte'!$P$2,IF(L13>0,MIN(L13,Reisekostenabrechnung!H13*(0.2*Reisekostenabrechnung!O13+0.4*Reisekostenabrechnung!P13+0.4*Reisekostenabrechnung!Q13)),0),0))))","v":""},{"$f":"IF(B13=\"\",\"\",IF(L13=0,IF($U$5='AP Auswahlwerte'!$I$2,IF(T13<>\"PAUSCHAL\",0,(O13*'AP Auswahlwerte'!$D$3+'AP Auswahlwerte'!$D$4*Reisekostenabrechnung!P13+Reisekostenabrechnung!Q13*'AP Auswahlwerte'!$D$5)),IF($U$5='AP Auswahlwerte'!$I$3,(O13*'AP Auswahlwerte'!$D$3+'AP Auswahlwerte'!$D$4*Reisekostenabrechnung!P13+Reisekostenabrechnung!Q13*'AP Auswahlwerte'!$D$5),\"Auswahl fehlt\")),0))","v":""},"-",{"$f":"(IF(D13-B13=0,0,IF(D13=\"\",0,IF(S13=0,IF(Y13='AP Auswahlwerte'!$A$2,VLOOKUP(G13,Tagessätze!A$4:N$230,4,FALSE),0))*AA13)))","v":0},0]
[null,null,null,null,null,null,"Deutschland",{"$f":"VLOOKUP(G14,Tagessätze!A$4:D$238,2,FALSE)","v":28},{"$f":"VLOOKUP(G14,Tagessätze!A$4:D$238,3,FALSE)","v":14},0,0,"",null,0,null,null,null,0,null,null,null,null,{"$f":"IF(B14=\"\",\"\",IF(Reisekostenabrechnung!$U$5=JA,\"Auswahl fehlt\",IF($U$5='AP Auswahlwerte'!$I$3,MIN(L14,(Reisekostenabrechnung!O14*0.2*Reisekostenabrechnung!$H14+Reisekostenabrechnung!P14*0.4*Reisekostenabrechnung!$H14+0.4*Reisekostenabrechnung!$H14*Reisekostenabrechnung!Q14)),IF(T14='AP Auswahlwerte'!$P$2,IF(L14>0,MIN(L14,Reisekostenabrechnung!H14*(0.2*Reisekostenabrechnung!O14+0.4*Reisekostenabrechnung!P14+0.4*Reisekostenabrechnung!Q14)),0),0))))","v":""},{"$f":"IF(B14=\"\",\"\",IF(L14=0,IF($U$5='AP Auswahlwerte'!$I$2,IF(T14<>\"PAUSCHAL\",0,(O14*'AP Auswahlwerte'!$D$3+'AP Auswahlwerte'!$D$4*Reisekostenabrechnung!P14+Reisekostenabrechnung!Q14*'AP Auswahlwerte'!$D$5)),IF($U$5='AP Auswahlwerte'!$I$3,(O14*'AP Auswahlwerte'!$D$3+'AP Auswahlwerte'!$D$4*Reisekostenabrechnung!P14+Reisekostenabrechnung!Q14*'AP Auswahlwerte'!$D$5),\"Auswahl fehlt\")),0))","v":""},"-",{"$f":"(IF(D14-B14=0,0,IF(D14=\"\",0,IF(S14=0,IF(Y14='AP Auswahlwerte'!$A$2,VLOOKUP(G14,Tagessätze!A$4:N$230,4,FALSE),0))*AA14)))","v":0},0]
[null,null,null,null,null,null,"Deutschland",{"$f":"VLOOKUP(G15,Tagessätze!A$4:D$238,2,FALSE)","v":28},{"$f":"VLOOKUP(G15,Tagessätze!A$4:D$238,3,FALSE)","v":14},0,0,"",null,0,null,null,null,0,null,null,null,null,{"$f":"IF(B15=\"\",\"\",IF(Reisekostenabrechnung!$U$5=JA,\"Auswahl fehlt\",IF($U$5='AP Auswahlwerte'!$I$3,MIN(L15,(Reisekostenabrechnung!O15*0.2*Reisekostenabrechnung!$H15+Reisekostenabrechnung!P15*0.4*Reisekostenabrechnung!$H15+0.4*Reisekostenabrechnung!$H15*Reisekostenabrechnung!Q15)),IF(T15='AP Auswahlwerte'!$P$2,IF(L15>0,MIN(L15,Reisekostenabrechnung!H15*(0.2*Reisekostenabrechnung!O15+0.4*Reisekostenabrechnung!P15+0.4*Reisekostenabrechnung!Q15)),0),0))))","v":""},{"$f":"IF(B15=\"\",\"\",IF(L15=0,IF($U$5='AP Auswahlwerte'!$I$2,IF(T15<>\"PAUSCHAL\",0,(O15*'AP Auswahlwerte'!$D$3+'AP Auswahlwerte'!$D$4*Reisekostenabrechnung!P15+Reisekostenabrechnung!Q15*'AP Auswahlwerte'!$D$5)),IF($U$5='AP Auswahlwerte'!$I$3,(O15*'AP Auswahlwerte'!$D$3+'AP Auswahlwerte'!$D$4*Reisekostenabrechnung!P15+Reisekostenabrechnung!Q15*'AP Auswahlwerte'!$D$5),\"Auswahl fehlt\")),0))","v":""},"-",{"$f":"(IF(D15-B15=0,0,IF(D15=\"\",0,IF(S15=0,IF(Y15='AP Auswahlwerte'!$A$2,VLOOKUP(G15,Tagessätze!A$4:N$230,4,FALSE),0))*AA15)))","v":0},0]
[null,null,null,null,null,null,"Deutschland",{"$f":"VLOOKUP(G16,Tagessätze!A$4:D$238,2,FALSE)","v":28},{"$f":"VLOOKUP(G16,Tagessätze!A$4:D$238,3,FALSE)","v":14},0,0,"",null,0,null,null,null,0,null,null,null,null,{"$f":"IF(B16=\"\",\"\",IF(Reisekostenabrechnung!$U$5=JA,\"Auswahl fehlt\",IF($U$5='AP Auswahlwerte'!$I$3,MIN(L16,(Reisekostenabrechnung!O16*0.2*Reisekostenabrechnung!$H16+Reisekostenabrechnung!P16*0.4*Reisekostenabrechnung!$H16+0.4*Reisekostenabrechnung!$H16*Reisekostenabrechnung!Q16)),IF(T16='AP Auswahlwerte'!$P$2,IF(L16>0,MIN(L16,Reisekostenabrechnung!H16*(0.2*Reisekostenabrechnung!O16+0.4*Reisekostenabrechnung!P16+0.4*Reisekostenabrechnung!Q16)),0),0))))","v":""},{"$f":"IF(B16=\"\",\"\",IF(L16=0,IF($U$5='AP Auswahlwerte'!$I$2,IF(T16<>\"PAUSCHAL\",0,(O16*'AP Auswahlwerte'!$D$3+'AP Auswahlwerte'!$D$4*Reisekostenabrechnung!P16+Reisekostenabrechnung!Q16*'AP Auswahlwerte'!$D$5)),IF($U$5='AP Auswahlwerte'!$I$3,(O16*'AP Auswahlwerte'!$D$3+'AP Auswahlwerte'!$D$4*Reisekostenabrechnung!P16+Reisekostenabrechnung!Q16*'AP Auswahlwerte'!$D$5),\"Auswahl fehlt\")),0))","v":""},"-",{"$f":"(IF(D16-B16=0,0,IF(D16=\"\",0,IF(S16=0,IF(Y16='AP Auswahlwerte'!$A$2,VLOOKUP(G16,Tagessätze!A$4:N$230,4,FALSE),0))*AA16)))","v":0},0]
[null,null,null,null,null,null,"Deutschland",{"$f":"VLOOKUP(G17,Tagessätze!A$4:D$238,2,FALSE)","v":28},{"$f":"VLOOKUP(G17,Tagessätze!A$4:D$238,3,FALSE)","v":14},0,0,"",null,0,null,null,null,0,null,null,null,null,{"$f":"IF(B17=\"\",\"\",IF(Reisekostenabrechnung!$U$5=JA,\"Auswahl fehlt\",IF($U$5='AP Auswahlwerte'!$I$3,MIN(L17,(Reisekostenabrechnung!O17*0.2*Reisekostenabrechnung!$H17+Reisekostenabrechnung!P17*0.4*Reisekostenabrechnung!$H17+0.4*Reisekostenabrechnung!$H17*Reisekostenabrechnung!Q17)),IF(T17='AP Auswahlwerte'!$P$2,IF(L17>0,MIN(L17,Reisekostenabrechnung!H17*(0.2*Reisekostenabrechnung!O17+0.4*Reisekostenabrechnung!P17+0.4*Reisekostenabrechnung!Q17)),0),0))))","v":""},{"$f":"IF(B17=\"\",\"\",IF(L17=0,IF($U$5='AP Auswahlwerte'!$I$2,IF(T17<>\"PAUSCHAL\",0,(O17*'AP Auswahlwerte'!$D$3+'AP Auswahlwerte'!$D$4*Reisekostenabrechnung!P17+Reisekostenabrechnung!Q17*'AP Auswahlwerte'!$D$5)),IF($U$5='AP Auswahlwerte'!$I$3,(O17*'AP Auswahlwerte'!$D$3+'AP Auswahlwerte'!$D$4*Reisekostenabrechnung!P17+Reisekostenabrechnung!Q17*'AP Auswahlwerte'!$D$5),\"Auswahl fehlt\")),0))","v":""},"-",{"$f":"(IF(D17-B17=0,0,IF(D17=\"\",0,IF(S17=0,IF(Y17='AP Auswahlwerte'!$A$2,VLOOKUP(G17,Tagessätze!A$4:N$230,4,FALSE),0))*AA17)))","v":0},0]
[null,null,null,null,null,null,"Deutschland",{"$f":"VLOOKUP(G18,Tagessätze!A$4:D$238,2,FALSE)","v":28},{"$f":"VLOOKUP(G18,Tagessätze!A$4:D$238,3,FALSE)","v":14},0,0,"",null,0,null,null,null,0,null,null,null,null,{"$f":"IF(B18=\"\",\"\",IF(Reisekostenabrechnung!$U$5=JA,\"Auswahl fehlt\",IF($U$5='AP Auswahlwerte'!$I$3,MIN(L18,(Reisekostenabrechnung!O18*0.2*Reisekostenabrechnung!$H18+Reisekostenabrechnung!P18*0.4*Reisekostenabrechnung!$H18+0.4*Reisekostenabrechnung!$H18*Reisekostenabrechnung!Q18)),IF(T18='AP Auswahlwerte'!$P$2,IF(L18>0,MIN(L18,Reisekostenabrechnung!H18*(0.2*Reisekostenabrechnung!O18+0.4*Reisekostenabrechnung!P18+0.4*Reisekostenabrechnung!Q18)),0),0))))","v":""},{"$f":"IF(B18=\"\",\"\",IF(L18=0,IF($U$5='AP Auswahlwerte'!$I$2,IF(T18<>\"PAUSCHAL\",0,(O18*'AP Auswahlwerte'!$D$3+'AP Auswahlwerte'!$D$4*Reisekostenabrechnung!P18+Reisekostenabrechnung!Q18*'AP Auswahlwerte'!$D$5)),IF($U$5='AP Auswahlwerte'!$I$3,(O18*'AP Auswahlwerte'!$D$3+'AP Auswahlwerte'!$D$4*Reisekostenabrechnung!P18+Reisekostenabrechnung!Q18*'AP Auswahlwerte'!$D$5),\"Auswahl fehlt\")),0))","v":""},"-",{"$f":"(IF(D18-B18=0,0,IF(D18=\"\",0,IF(S18=0,IF(Y18='AP Auswahlwerte'!$A$2,VLOOKUP(G18,Tagessätze!A$4:N$230,4,FALSE),0))*AA18)))","v":0},0]
[null,null,null,null,null,null,"Deutschland",{"$f":"VLOOKUP(G19,Tagessätze!A$4:D$238,2,FALSE)","v":28},{"$f":"VLOOKUP(G19,Tagessätze!A$4:D$238,3,FALSE)","v":14},0,0,"",null,0,null,null,null,{"$f":"SUM(S19:V19)","v":0},null,null,null,null,{"$f":"IF(B19=\"\",\"\",IF(Reisekostenabrechnung!$U$5=JA,\"Auswahl fehlt\",IF($U$5='AP Auswahlwerte'!$I$3,MIN(L19,(Reisekostenabrechnung!O19*0.2*Reisekostenabrechnung!$H19+Reisekostenabrechnung!P19*0.4*Reisekostenabrechnung!$H19+0.4*Reisekostenabrechnung!$H19*Reisekostenabrechnung!Q19)),IF(T19='AP Auswahlwerte'!$P$2,IF(L19>0,MIN(L19,Reisekostenabrechnung!H19*(0.2*Reisekostenabrechnung!O19+0.4*Reisekostenabrechnung!P19+0.4*Reisekostenabrechnung!Q19)),0),0))))","v":""},{"$f":"IF(B19=\"\",\"\",IF(L19=0,IF($U$5='AP Auswahlwerte'!$I$2,IF(T19<>\"PAUSCHAL\",0,(O19*'AP Auswahlwerte'!$D$3+'AP Auswahlwerte'!$D$4*Reisekostenabrechnung!P19+Reisekostenabrechnung!Q19*'AP Auswahlwerte'!$D$5)),IF($U$5='AP Auswahlwerte'!$I$3,(O19*'AP Auswahlwerte'!$D$3+'AP Auswahlwerte'!$D$4*Reisekostenabrechnung!P19+Reisekostenabrechnung!Q19*'AP Auswahlwerte'!$D$5),\"Auswahl fehlt\")),0))","v":""},"-",{"$f":"(IF(D19-B19=0,0,IF(D19=\"\",0,IF(S19=0,IF(Y19='AP Auswahlwerte'!$A$2,VLOOKUP(G19,Tagessätze!A$4:N$230,4,FALSE),0))*AA19)))","v":0},0]
[null,null,null,null,null,null,"Deutschland",{"$f":"VLOOKUP(G20,Tagessätze!A$4:D$238,2,FALSE)","v":28},{"$f":"VLOOKUP(G20,Tagessätze!A$4:D$238,3,FALSE)","v":14},{"$f":"IF(D20-B20>1,D20-B20-1,0)","v":0},{"$f":"IF(B20=\"\",0,IF(D20=B20,IF(E20-C20>8,1,0),IF(F20=\"JA\",2,IF(24-C20+E20>8,1,0))))","v":0},{"$f":"IF(B20=\"\",\"\",IF($H$5=\"BITTE AUSWÄHLEN\",\"Wahl fehlt\",IF($H$5=\"JA\",(H20*J20+I20*K20),0)))","v":""},null,{"$f":"M20*$N$11","v":0},null,null,null,0,null,null,null,null,{"$f":"IF(B20=\"\",\"\",IF(Reisekostenabrechnung!$U$5=JA,\"Auswahl fehlt\",IF($U$5='AP Auswahlwerte'!$I$3,MIN(L20,(Reisekostenabrechnung!O20*0.2*Reisekostenabrechnung!$H20+Reisekostenabrechnung!P20*0.4*Reisekostenabrechnung!$H20+0.4*Reisekostenabrechnung!$H20*Reisekostenabrechnung!Q20)),IF(T20='AP Auswahlwerte'!$P$2,IF(L20>0,MIN(L20,Reisekostenabrechnung!H20*(0.2*Reisekostenabrechnung!O20+0.4*Reisekostenabrechnung!P20+0.4*Reisekostenabrechnung!Q20)),0),0))))","v":""},{"$f":"IF(B20=\"\",\"\",IF(L20=0,IF($U$5='AP Auswahlwerte'!$I$2,IF(T20<>\"PAUSCHAL\",0,(O20*'AP Auswahlwerte'!$D$3+'AP Auswahlwerte'!$D$4*Reisekostenabrechnung!P20+Reisekostenabrechnung!Q20*'AP Auswahlwerte'!$D$5)),IF($U$5='AP Auswahlwerte'!$I$3,(O20*'AP Auswahlwerte'!$D$3+'AP Auswahlwerte'!$D$4*Reisekostenabrechnung!P20+Reisekostenabrechnung!Q20*'AP Auswahlwerte'!$D$5),\"Auswahl fehlt\")),0))","v":""},"-",{"$f":"(IF(D20-B20=0,0,IF(D20=\"\",0,IF(S20=0,IF(Y20='AP Auswahlwerte'!$A$2,VLOOKUP(G20,Tagessätze!A$4:N$230,4,FALSE),0))*AA20)))","v":0},0]
{"$rows_left_out":34}
{"sheet":"Sonstige Kosten","index":2,"n_rows":48,"n_cols":9,"rows_kept":48,"cut":false,"hidden":false,"merged":[[2,5,2,8],[0,0,0,3],[1,0,1,3],[2,0,2,3],[3,5,3,8],[0,5,1,8]]}
[{"$f":"Reisekostenabrechnung!B1","v":"Firmennamen und Anschrift eingeben"},null,null,null,null,"Achtung:"]
["Reisekostenabrechung"]
[{"$f":"Reisekostenabrechnung!B3","v":"Arbeitnehmer: Name eingeben"},null,null,null,null,"Nur von VTP"]
[null,null,null,null,null,"zu bearbeiten!"]
[null,null,null,null,null,"Betrag","VorSt-Schl.","KOST-","Konto"]
["Datum\nTT.MM.JJ","Beleg-\nnummer","Bezeichnung","Betrag",null," ","+ Konto #","Konto",0]
[null,null,null,null,null,{"$f":"D7","v":0},null,null,{"$f":"I6","v":0}]
[null,null,null,null,null,{"$f":"D8","v":0},null,null,{"$f":"I7","v":0}]
[null,null,null,null,null,0,null,null,0]
[null,null,null,null,null,0,null,null,0]
[null,null,null,null,null,0,null,null,0]
[null,null,null,null,null,0,null,null,0]
[null,null,null,null,null,0,null,null,0]
[null,null,null,null,null,0,null,null,0]
[null,null,null,null,null,0,null,null,0]
[null,null,null,null,null,0,null,null,0]
[null,null,null,null,null,0,null,null,0]
[null,null,null,null,null,0,null,null,0]
[null,null,null,null,null,0,null,null,0]
[null,null,null,null,null,0,null,null,0]
{"$rows_left_out":29}
{"sheet":"Tagessätze","index":3,"n_rows":238,"n_cols":6,"rows_kept":238,"cut":false,"hidden":true,"merged":[[0,0,2,0],[0,1,0,2],[0,3,1,3]]}
["Land"," Pauschbeträge  für Verpflegungsmehraufwendungen\nbei  einer Abwesenheitsdauer je Kalendertag von",null,"Pauschbetrag  für \nÜbernachtungskosten"]
[null,"mind. 24 Stunden","weniger als 24, \naber mind. 8 Stunden"]
[null,"EUR","EUR","EUR"]
["Deutschland",28,14,20,null,"Übersicht über die ab 1. Januar 2026 geltenden Pauschbeträge für"]
["Afghanistan",30,20,95,null,"Verpflegungsmehraufwendungen und Übernachtungskosten im Ausland"]
["Ägypten",50,33,112]
["Äthiopien",44,29,159]
["Äquatorialguinea",42,28,166,null,"BMF-Schreiben vom 5. Dezember 2025"]
["Albanien",33,22,116]
["Algerien",47,32,120]
["Andorra",45,30,135]
["Angola",40,27,368]
["Antigua und Barbuda",66,44,203,null,"Pauschale Trinidad Tobago"]
["Argentinien",42,28,119]
["Armenien",29,20,107]
["Aserbaidschan",44,29,88]
["Australien - Canberra",74,49,186]
["Australien - Sydney",57,38,173]
["Australien - im Übrigen",57,38,173]
["Bahrain",48,32,153]
{"$rows_left_out":219}
{"sheet":"AP Auswahlwerte","index":4,"n_rows":13,"n_cols":18,"rows_kept":13,"cut":false,"hidden":true,"merged":[]}
["BITTE AUSWÄHLEN",null,"Sachbezugswerte 2026",null,"pauschale Kürzung Pauschale 24h",null,null,null,"BITTE AUSWÄHLEN",null,null,null,null,null,null,"OHNE Verpfleg.",null,"BITTE AUSWÄHLEN"]
["JA",null,null,null,"wenn fehlender Ausweis in Rechnung",null,null,null,"Arbeitnehmer werden tatsächliche Verpflegungskosten erstattet; bei Pauschalen erfolgt Kürzung 20%/40%/40% des VMA.",null,null,null,null,null,null,"PAUSCHAL",null,"Barzahlung / aus Kasse"]
["NEIN",null,"FRÜHSTÜCK",2.37,0.2,null,null,null,"Zahlung der steuerfreien Pauschale (mit prozentualer Kürzung für Mahlzeiten) ",null,null,null,null,null,null,"Betrag?",null,"Überweisung"]
["-",null,"MITTAGESSEN",4.57,0.4,null,null,null,null,null,null,null,null,null,null,null,null,"Lohn- / Gehaltsabrechnung"]
[null,null,"ABENDESSEN",4.57,0.4]
[]
["Übernachtungspauschale"]
[0,"Nein"]
[1,"JA",null,null,null,null,null,null,"BITTE AUSWÄHLEN"]
[null,null,null,null,null,null,null,null,"Entfällt (mangels Kosten, Erstattung oder steuerpfl. Mahlzeiten)"]
["Fahrzeug",null,null,null,null,null,null,null,"Individuelle Versteuerung des Sachbezugswertes durch AN"]
["Kfz",0.3,null,null,null,null,null,null,"Pauschale Versteuerung des Sachbezugswertes durch AG"]
["sonst.Motorisierung",0.2]

{"sheet":"Sonstige Kosten - Auswahl","index":5,"n_rows":17,"n_cols":1,"rows_kept":17,"cut":false,"hidden":true,"merged":[]}
["Parken"]
["Tanken"]
["Taxi"]
["Bewirtung Arbeitnehmer"]
["Bewirtung Geschäftsfreunde"]
["Bürobedarf"]
["EDV-Bedarf"]
["Geschenke bis 50 Euro"]
["Geschenke über 50 Euro"]
["Kfz-Reparatur"]
["Mautgebühren"]
["Porto"]
["Sonstige laufende Kfz-Kosten"]
["Sonstiges"]
[]
[]
["ausblenden"]